{"text_format":"1","workbook":"xlsx","n_sheets":5,"sheets":["Instruccions - Instrucciones","Dades i com... - Datos y com...","Pressupost - Pressupuesto","Detall - Detalle","Llista desplegable"],"not_rendered":{"charts":0,"images":2,"macros":1,"external_links":0,"defined_names":11,"comments":0,"pivot_tables":0},"unopened":[],"bounds":{"document_bytes":16777216,"sheet_cells":100000,"rows_first":2000,"rows_last":500,"rows_between":2000,"halvings":0,"cell_chars":16384,"cell_head_chars":4096},"cells_cut":0,"cells_raw":0,"read":"whole","date_system":"1900"}

{"sheet":"Instruccions - Instrucciones","index":0,"n_rows":30,"n_cols":7,"rows_kept":30,"cut":false,"hidden":false,"merged":[]}
[]
[null,"Instruccions d'ús del formulari",null,null,null,null,"Instrucciones de uso del formulario"]
[]
[null,"Aquest formulari de pressupost consta de 3 pestanyes:",null,null,null,null,"Este formulario de presupuesto consta de 3 pestañas:"]
[null,"1. Dades i comprovacions: s'introduiran les dades generals del projecte i també inclourà les verificacions per tal de comprovar que s'ha emplenat correctament.",null,null,null,null,"1. Datos y comprobaciones: se introducirán los datos generales del proyecto y también incluirá las verificaciones para comprobar que se ha rellenado correctamente."]
[null,"2. Detall despeses: S'inclouran les dades relatives a les despeses del projecte, així com la seva imputació als diferents projectes.",null,null,null,null,"2. Detalle gastos: Se incluirán los datos relativos a los gastos del proyecto, así como su imputación a los diferentes proyectos."]
[null,"3. Pressupost: És la visualització en format compte de resultats de les despeses que s'han introduït a la pestanya detall de despeses. Es pot visualitzar les despeses de la totalitat del projecte o per cada activitat.",null,null,null,null,"3. Presupuesto: Es la visualización en formato cuenta de resultados de los gastos que se han introducido en la pestaña detalle de gastos. Se pueden visualizar los gastos de la totalidad del proyecto o por cada actividad."]
[]
{"$rows_left_out":23}
{"sheet":"Dades i com... - Datos y com...","index":1,"n_rows":65,"n_cols":10,"rows_kept":65,"cut":false,"hidden":false,"merged":[[6,3,6,9],[50,6,50,9],[33,3,33,9],[13,3,13,4],[17,3,17,4],[27,3,27,4],[28,3,28,4],[35,4,35,5],[36,4,36,5],[47,6,48,6],[40,5,40,11],[9,3,9,8],[29,3,29,4],[64,5,65,11],[12,6,12,7],[13,6,13,7],[14,6,14,7],[15,6,15,7],[54,6,54,7],[29,6,29,9],[51,6,51,7],[52,6,52,7],[53,6,53,7],[24,3,24,9],[27,6,27,9],[28,6,28,9],[40,1,40,4],[55,6,55,7],[56,6,56,7]]}
[]
[null,"Convocatòria 2023 / Convocatoria 2023"]
[null,"Formulari pressupost / Formulario pressupuesto"]
[]
[]
[]
[null,null,null,"DADES GENERALS / DATOS GENERALES"]
[]
{"$rows_left_out":58}
{"sheet":"Pressupost - Pressupuesto","index":2,"n_rows":32,"n_cols":34,"rows_kept":32,"cut":false,"hidden":false,"merged":[[2,2,2,8],[2,9,2,13]]}
[{"$f":"+VLOOKUP(A4,'Dades i com... - Datos y com...'!$B$43:$D$61,3,FALSE)","v":"Totes les activitats"}]
[]
[null,null,"DISTRIBUCIÓ PRESSUPOST PER ENTITAT FINANÇADORA",null,null,null,null,null,null,"DISTRIBUCIÓ PRESSUPOST PER ENTITAT EXECUTORA"]
[1,{"$f":"+IF(A1=\"TOTES LES ACTIVITATS\",\"TOTAL PROJECTE\",\"TOTAL \"&A1)","v":"TOTAL PROJECTE"},"ACCD","ALTRES FINANÇADORS","LÍDER","AGRUPADA","SOCI_LOCAL","COL·LECTIUS PROTAGONISTES","TERCER SECTOR","LÍDER","AGRUPADA","SOCI_LOCAL","COL·LECTIUS PROTAGONISTES","TERCER SECTOR",{"$f":"+IF(A1=\"TOTES LES ACTIVITATS\",IF('Dades i com... - Datos y com...'!D44=\"\",\"\",'Dades i com... - Datos y com...'!D44),\"\")","v":1},{"$f":"+IF(A1=\"TOTES LES ACTIVITATS\",IF('Dades i com... - Datos y com...'!D45=\"\",\"\",'Dades i com... - Datos y com...'!D45),\"\")","v":""},{"$f":"+IF(A1=\"TOTES LES ACTIVITATS\",IF('Dades i com... - Datos y com...'!D46=\"\",\"\",'Dades i com... - Datos y com...'!D46),\"\")","v":""},{"$f":"+IF(A1=\"TOTES LES ACTIVITATS\",IF('Dades i com... - Datos y com...'!D47=\"\",\"\",'Dades i com... - Datos y com...'!D47),\"\")","v":""},{"$f":"+IF(A1=\"TOTES LES ACTIVITATS\",IF('Dades i com... - Datos y com...'!D48=\"\",\"\",'Dades i com... - Datos y com...'!D48),\"\")","v":""},{"$f":"+IF(A1=\"TOTES LES ACTIVITATS\",IF('Dades i com... - Datos y com...'!D49=\"\",\"\",'Dades i com... - Datos y com...'!D49),\"\")","v":""},{"$f":"+IF(A1=\"TOTES LES ACTIVITATS\",IF('Dades i com... - Datos y com...'!D50=\"\",\"\",'Dades i com... - Datos y com...'!D50),\"\")","v":""},{"$f":"+IF(A1=\"TOTES LES ACTIVITATS\",IF('Dades i com... - Datos y com...'!D51=\"\",\"\",'Dades i com... - Datos y com...'!D51),\"\")","v":""},{"$f":"+IF(A1=\"TOTES LES ACTIVITATS\",IF('Dades i com... - Datos y com...'!D52=\"\",\"\",'Dades i com... - Datos y com...'!D52),\"\")","v":""},{"$f":"+IF(A1=\"TOTES LES ACTIVITATS\",IF('Dades i com... - Datos y com...'!D53=\"\",\"\",'Dades i com... - Datos y com...'!D53),\"\")","v":""},{"$f":"+IF(A1=\"TOTES LES ACTIVITATS\",IF('Dades i com... - Datos y com...'!D54=\"\",\"\",'Dades i com... - Datos y com...'!D54),\"\")","v":""},{"$f":"+IF(A1=\"TOTES LES ACTIVITATS\",IF('Dades i com... - Datos y com...'!D55=\"\",\"\",'Dades i com... - Datos y com...'!D55),\"\")","v":""},{"$f":"+IF(A1=\"TOTES LES ACTIVITATS\",IF('Dades i com... - Datos y com...'!D56=\"\",\"\",'Dades i com... - Datos y com...'!D56),\"\")","v":""},{"$f":"+IF(A1=\"TOTES LES ACTIVITATS\",IF('Dades i com... - Datos y com...'!D57=\"\",\"\",'Dades i com... - Datos y com...'!D57),\"\")","v":""},{"$f":"+IF(A1=\"TOTES LES ACTIVITATS\",IF('Dades i com... - Datos y com...'!D58=\"\",\"\",'Dades i com... - Datos y com...'!D58),\"\")","v":""},{"$f":"+IF(A1=\"TOTES LES ACTIVITATS\",IF('Dades i com... - Datos y com...'!D59=\"\",\"\",'Dades i com... - Datos y com...'!D59),\"\")","v":""},{"$f":"+IF(A1=\"TOTES LES ACTIVITATS\",IF('Dades i com... - Datos y com...'!D60=\"\",\"\",'Dades i com... - Datos y com...'!D60),\"\")","v":""},{"$f":"+IF(A1=\"TOTES LES ACTIVITATS\",IF('Dades i com... - Datos y com...'!D61=\"\",\"\",'Dades i com... - Datos y com...'!D61),\"\")","v":""},{"$f":"+IF(A1=\"TOTES LES ACTIVITATS\",IF('Dades i com... - Datos y com...'!D62=\"\",\"\",'Dades i com... - Datos y com...'!D62),\"\")","v":""},{"$f":"+IF(A1=\"TOTES LES ACTIVITATS\",IF('Dades i com... - Datos y com...'!D63=\"\",\"\",'Dades i com... - Datos y com...'!D63),\"\")","v":""}]
["DESPESES DIRECTES CORRENTS (Capítol IV) / GASTOS DIRECTOS CORRIENTES (Capítulo IV)",{"$f":"SUM(C5:I5)","v":0},{"$f":"+SUM(C6,C10:C26)","v":0},{"$f":"+SUM(D6,D10:D26)","v":0},{"$f":"+SUM(E6,E10:E26)","v":0},0,{"$f":"+SUM(G6,G10:G26)","v":0},{"$f":"+SUM(H6,H10:H26)","v":0},{"$f":"+SUM(I6,I10:I26)","v":0},{"$f":"+SUM(J6,J10:J26)","v":0},0,0,{"$f":"+SUM(M6,M10:M26)","v":0},0,{"$f":"+SUM(O6,O10:O26)","v":0},0,0,0,0,0,0,0,0,0,0,0,0,0,0,0,0,0,0,0]
["a1. Remuneració  personal assalariat / Remuneracion personal asalariado",0,{"$f":"SUM(C7:C9)","v":0},{"$f":"SUM(D7:D9)","v":0},{"$f":"SUM(E7:E9)","v":0},0,{"$f":"SUM(G7:G9)","v":0},{"$f":"SUM(H7:H9)","v":0},{"$f":"SUM(I7:I9)","v":0},{"$f":"SUM(J7:J9)","v":0},0,0,{"$f":"SUM(M7:M9)","v":0},0,0,0,0,0,0,0,0,0,0,0,0,0,0,0,0,0,0,0,0,0]
["a1.1 Personal assalariat local / Personal asalariado local",0,{"$f":"+IF(OR($A$1=\"TOTES LES ACTIVITATS\",$A$1=\"\"),SUMIF('Detall - Detalle'!$AA:$AA,$A7,'Detall - Detalle'!$W:$W),SUMIFS('Detall - Detalle'!$W:$W,'Detall - Detalle'!$T:$T,'Pressupost - Pressupuesto'!$A$1,'Detall - Detalle'!$AA:$AA,'Pressupost - Pressupuesto'!$A7))","v":0},{"$f":"+IF(OR($A$1=\"TOTES LES ACTIVITATS\",$A$1=\"\"),SUMIF('Detall - Detalle'!$AA:$AA,$A7,'Detall - Detalle'!$X:$X),SUMIFS('Detall - Detalle'!$X:$X,'Detall - Detalle'!$T:$T,'Pressupost - Pressupuesto'!$A$1,'Detall - Detalle'!$AA:$AA,'Pressupost - Pressupuesto'!$A7))","v":0},{"$f":"+IF(OR($A$1=\"TOTES LES ACTIVITATS\",$A$1=\"\"),SUMIFS('Detall - Detalle'!$Y:$Y,'Detall - Detalle'!$AA:$AA,'Pressupost - Pressupuesto'!$A7,'Detall - Detalle'!$Z:$Z,E$4),SUMIFS('Detall - Detalle'!$Y:$Y,'Detall - Detalle'!$T:$T,'Pressupost - Pressupuesto'!$A$1,'Detall - Detalle'!$AA:$AA,'Pressupost - Pressupuesto'!$A7,'Detall - Detalle'!$Z:$Z,E$4))","v":0},{"$f":"+IF(OR($A$1=\"TOTES LES ACTIVITATS\",$A$1=\"\"),SUMIFS('Detall - Detalle'!$Y:$Y,'Detall - Detalle'!$AA:$AA,'Pressupost - Pressupuesto'!$A7,'Detall - Detalle'!$Z:$Z,F$4),SUMIFS('Detall - Detalle'!$Y:$Y,'Detall - Detalle'!$T:$T,'Pressupost - Pressupuesto'!$A$1,'Detall - Detalle'!$AA:$AA,'Pressupost - Pressupuesto'!$A7,'Detall - Detalle'!$Z:$Z,F$4))","v":0},{"$f":"+IF(OR($A$1=\"TOTES LES ACTIVITATS\",$A$1=\"\"),SUMIFS('Detall - Detalle'!$Y:$Y,'Detall - Detalle'!$AA:$AA,'Pressupost - Pressupuesto'!$A7,'Detall - Detalle'!$Z:$Z,G$4),SUMIFS('Detall - Detalle'!$Y:$Y,'Detall - Detalle'!$T:$T,'Pressupost - Pressupuesto'!$A$1,'Detall - Detalle'!$AA:$AA,'Pressupost - Pressupuesto'!$A7,'Detall - Detalle'!$Z:$Z,G$4))","v":0},{"$f":"+IF(OR($A$1=\"TOTES LES ACTIVITATS\",$A$1=\"\"),SUMIFS('Detall - Detalle'!$Y:$Y,'Detall - Detalle'!$AA:$AA,'Pressupost - Pressupuesto'!$A7,'Detall - Detalle'!$Z:$Z,H$4),SUMIFS('Detall - Detalle'!$Y:$Y,'Detall - Detalle'!$T:$T,'Pressupost - Pressupuesto'!$A$1,'Detall - Detalle'!$AA:$AA,'Pressupost - Pressupuesto'!$A7,'Detall - Detalle'!$Z:$Z,H$4))","v":0},{"$f":"+IF(OR($A$1=\"TOTES LES ACTIVITATS\",$A$1=\"\"),SUMIFS('Detall - Detalle'!$Y:$Y,'Detall - Detalle'!$AA:$AA,'Pressupost - Pressupuesto'!$A7,'Detall - Detalle'!$Z:$Z,I$4),SUMIFS('Detall - Detalle'!$Y:$Y,'Detall - Detalle'!$T:$T,'Pressupost - Pressupuesto'!$A$1,'Detall - Detalle'!$AA:$AA,'Pressupost - Pressupuesto'!$A7,'Detall - Detalle'!$Z:$Z,I$4))","v":0},{"$f":"+IF(OR($A$1=\"TOTES LES ACTIVITATS\",$A$1=\"\"),SUMIFS('Detall - Detalle'!$V:$V,'Detall - Detalle'!$AA:$AA,'Pressupost - Pressupuesto'!$A7,'Detall - Detalle'!$Z:$Z,J$4),SUMIFS('Detall - Detalle'!$V:$V,'Detall - Detalle'!$T:$T,'Pressupost - Pressupuesto'!$A$1,'Detall - Detalle'!$AA:$AA,'Pressupost - Pressupuesto'!$A7,'Detall - Detalle'!$Z:$Z,J$4))","v":0},{"$f":"+IF(OR($A$1=\"TOTES LES ACTIVITATS\",$A$1=\"\"),SUMIFS('Detall - Detalle'!$V:$V,'Detall - Detalle'!$AA:$AA,'Pressupost - Pressupuesto'!$A7,'Detall - Detalle'!$Z:$Z,K$4),SUMIFS('Detall - Detalle'!$V:$V,'Detall - Detalle'!$T:$T,'Pressupost - Pressupuesto'!$A$1,'Detall - Detalle'!$AA:$AA,'Pressupost - Pressupuesto'!$A7,'Detall - Detalle'!$Z:$Z,K$4))","v":0},{"$f":"+IF(OR($A$1=\"TOTES LES ACTIVITATS\",$A$1=\"\"),SUMIFS('Detall - Detalle'!$V:$V,'Detall - Detalle'!$AA:$AA,'Pressupost - Pressupuesto'!$A7,'Detall - Detalle'!$Z:$Z,L$4),SUMIFS('Detall - Detalle'!$V:$V,'Detall - Detalle'!$T:$T,'Pressupost - Pressupuesto'!$A$1,'Detall - Detalle'!$AA:$AA,'Pressupost - Pressupuesto'!$A7,'Detall - Detalle'!$Z:$Z,L$4))","v":0},{"$f":"+IF(OR($A$1=\"TOTES LES ACTIVITATS\",$A$1=\"\"),SUMIFS('Detall - Detalle'!$V:$V,'Detall - Detalle'!$AA:$AA,'Pressupost - Pressupuesto'!$A7,'Detall - Detalle'!$Z:$Z,M$4),SUMIFS('Detall - Detalle'!$V:$V,'Detall - Detalle'!$T:$T,'Pressupost - Pressupuesto'!$A$1,'Detall - Detalle'!$AA:$AA,'Pressupost - Pressupuesto'!$A7,'Detall - Detalle'!$Z:$Z,M$4))","v":0},{"$f":"+IF(OR($A$1=\"TOTES LES ACTIVITATS\",$A$1=\"\"),SUMIFS('Detall - Detalle'!$V:$V,'Detall - Detalle'!$AA:$AA,'Pressupost - Pressupuesto'!$A7,'Detall - Detalle'!$Z:$Z,N$4),SUMIFS('Detall - Detalle'!$V:$V,'Detall - Detalle'!$T:$T,'Pressupost - Pressupuesto'!$A$1,'Detall - Detalle'!$AA:$AA,'Pressupost - Pressupuesto'!$A7,'Detall - Detalle'!$Z:$Z,N$4))","v":0},{"$f":"+SUMIFS('Detall - Detalle'!$V:$V,'Detall - Detalle'!$T:$T,O$4,'Detall - Detalle'!$AA:$AA,'Pressupost - Pressupuesto'!$A7)","v":0},{"$f":"+SUMIFS('Detall - Detalle'!$V:$V,'Detall - Detalle'!$T:$T,P$4,'Detall - Detalle'!$AA:$AA,'Pressupost - Pressupuesto'!$A7)","v":0},{"$f":"+SUMIFS('Detall - Detalle'!$V:$V,'Detall - Detalle'!$T:$T,Q$4,'Detall - Detalle'!$AA:$AA,'Pressupost - Pressupuesto'!$A7)","v":0},{"$f":"+SUMIFS('Detall - Detalle'!$V:$V,'Detall - Detalle'!$T:$T,R$4,'Detall - Detalle'!$AA:$AA,'Pressupost - Pressupuesto'!$A7)","v":0},{"$f":"+SUMIFS('Detall - Detalle'!$V:$V,'Detall - Detalle'!$T:$T,S$4,'Detall - Detalle'!$AA:$AA,'Pressupost - Pressupuesto'!$A7)","v":0},{"$f":"+SUMIFS('Detall - Detalle'!$V:$V,'Detall - Detalle'!$T:$T,T$4,'Detall - Detalle'!$AA:$AA,'Pressupost - Pressupuesto'!$A7)","v":0},{"$f":"+SUMIFS('Detall - Detalle'!$V:$V,'Detall - Detalle'!$T:$T,U$4,'Detall - Detalle'!$AA:$AA,'Pressupost - Pressupuesto'!$A7)","v":0},{"$f":"+SUMIFS('Detall - Detalle'!$V:$V,'Detall - Detalle'!$T:$T,V$4,'Detall - Detalle'!$AA:$AA,'Pressupost - Pressupuesto'!$A7)","v":0},{"$f":"+SUMIFS('Detall - Detalle'!$V:$V,'Detall - Detalle'!$T:$T,W$4,'Detall - Detalle'!$AA:$AA,'Pressupost - Pressupuesto'!$A7)","v":0},{"$f":"+SUMIFS('Detall - Detalle'!$V:$V,'Detall - Detalle'!$T:$T,X$4,'Detall - Detalle'!$AA:$AA,'Pressupost - Pressupuesto'!$A7)","v":0},{"$f":"+SUMIFS('Detall - Detalle'!$V:$V,'Detall - Detalle'!$T:$T,Y$4,'Detall - Detalle'!$AA:$AA,'Pressupost - Pressupuesto'!$A7)","v":0},{"$f":"+SUMIFS('Detall - Detalle'!$V:$V,'Detall - Detalle'!$T:$T,Z$4,'Detall - Detalle'!$AA:$AA,'Pressupost - Pressupuesto'!$A7)","v":0},{"$f":"+SUMIFS('Detall - Detalle'!$V:$V,'Detall - Detalle'!$T:$T,AA$4,'Detall - Detalle'!$AA:$AA,'Pressupost - Pressupuesto'!$A7)","v":0},{"$f":"+SUMIFS('Detall - Detalle'!$V:$V,'Detall - Detalle'!$T:$T,AB$4,'Detall - Detalle'!$AA:$AA,'Pressupost - Pressupuesto'!$A7)","v":0},{"$f":"+SUMIFS('Detall - Detalle'!$V:$V,'Detall - Detalle'!$T:$T,AC$4,'Detall - Detalle'!$AA:$AA,'Pressupost - Pressupuesto'!$A7)","v":0},{"$f":"+SUMIFS('Detall - Detalle'!$V:$V,'Detall - Detalle'!$T:$T,AD$4,'Detall - Detalle'!$AA:$AA,'Pressupost - Pressupuesto'!$A7)","v":0},{"$f":"+SUMIFS('Detall - Detalle'!$V:$V,'Detall - Detalle'!$T:$T,AE$4,'Detall - Detalle'!$AA:$AA,'Pressupost - Pressupuesto'!$A7)","v":0},{"$f":"+SUMIFS('Detall - Detalle'!$V:$V,'Detall - Detalle'!$T:$T,AF$4,'Detall - Detalle'!$AA:$AA,'Pressupost - Pressupuesto'!$A7)","v":0},{"$f":"+SUMIFS('Detall - Detalle'!$V:$V,'Detall - Detalle'!$T:$T,AG$4,'Detall - Detalle'!$AA:$AA,'Pressupost - Pressupuesto'!$A7)","v":0},{"$f":"+SUMIFS('Detall - Detalle'!$V:$V,'Detall - Detalle'!$T:$T,AH$4,'Detall - Detalle'!$AA:$AA,'Pressupost - Pressupuesto'!$A7)","v":0}]
["a1.2 Personal assalariat expatriat / Personal asalariado expatriado",0,{"$f":"+IF(OR($A$1=\"TOTES LES ACTIVITATS\",$A$1=\"\"),SUMIF('Detall - Detalle'!$AA:$AA,$A8,'Detall - Detalle'!$W:$W),SUMIFS('Detall - Detalle'!$W:$W,'Detall - Detalle'!$T:$T,'Pressupost - Pressupuesto'!$A$1,'Detall - Detalle'!$AA:$AA,'Pressupost - Pressupuesto'!$A8))","v":0},{"$f":"+IF(OR($A$1=\"TOTES LES ACTIVITATS\",$A$1=\"\"),SUMIF('Detall - Detalle'!$AA:$AA,$A8,'Detall - Detalle'!$X:$X),SUMIFS('Detall - Detalle'!$X:$X,'Detall - Detalle'!$T:$T,'Pressupost - Pressupuesto'!$A$1,'Detall - Detalle'!$AA:$AA,'Pressupost - Pressupuesto'!$A8))","v":0},{"$f":"+IF(OR($A$1=\"TOTES LES ACTIVITATS\",$A$1=\"\"),SUMIFS('Detall - Detalle'!$Y:$Y,'Detall - Detalle'!$AA:$AA,'Pressupost - Pressupuesto'!$A8,'Detall - Detalle'!$Z:$Z,E$4),SUMIFS('Detall - Detalle'!$Y:$Y,'Detall - Detalle'!$T:$T,'Pressupost - Pressupuesto'!$A$1,'Detall - Detalle'!$AA:$AA,'Pressupost - Pressupuesto'!$A8,'Detall - Detalle'!$Z:$Z,E$4))","v":0},{"$f":"+IF(OR($A$1=\"TOTES LES ACTIVITATS\",$A$1=\"\"),SUMIFS('Detall - Detalle'!$Y:$Y,'Detall - Detalle'!$AA:$AA,'Pressupost - Pressupuesto'!$A8,'Detall - Detalle'!$Z:$Z,F$4),SUMIFS('Detall - Detalle'!$Y:$Y,'Detall - Detalle'!$T:$T,'Pressupost - Pressupuesto'!$A$1,'Detall - Detalle'!$AA:$AA,'Pressupost - Pressupuesto'!$A8,'Detall - Detalle'!$Z:$Z,F$4))","v":0},{"$f":"+IF(OR($A$1=\"TOTES LES ACTIVITATS\",$A$1=\"\"),SUMIFS('Detall - Detalle'!$Y:$Y,'Detall - Detalle'!$AA:$AA,'Pressupost - Pressupuesto'!$A8,'Detall - Detalle'!$Z:$Z,G$4),SUMIFS('Detall - Detalle'!$Y:$Y,'Detall - Detalle'!$T:$T,'Pressupost - Pressupuesto'!$A$1,'Detall - Detalle'!$AA:$AA,'Pressupost - Pressupuesto'!$A8,'Detall - Detalle'!$Z:$Z,G$4))","v":0},{"$f":"+IF(OR($A$1=\"TOTES LES ACTIVITATS\",$A$1=\"\"),SUMIFS('Detall - Detalle'!$Y:$Y,'Detall - Detalle'!$AA:$AA,'Pressupost - Pressupuesto'!$A8,'Detall - Detalle'!$Z:$Z,H$4),SUMIFS('Detall - Detalle'!$Y:$Y,'Detall - Detalle'!$T:$T,'Pressupost - Pressupuesto'!$A$1,'Detall - Detalle'!$AA:$AA,'Pressupost - Pressupuesto'!$A8,'Detall - Detalle'!$Z:$Z,H$4))","v":0},{"$f":"+IF(OR($A$1=\"TOTES LES ACTIVITATS\",$A$1=\"\"),SUMIFS('Detall - Detalle'!$Y:$Y,'Detall - Detalle'!$AA:$AA,'Pressupost - Pressupuesto'!$A8,'Detall - Detalle'!$Z:$Z,I$4),SUMIFS('Detall - Detalle'!$Y:$Y,'Detall - Detalle'!$T:$T,'Pressupost - Pressupuesto'!$A$1,'Detall - Detalle'!$AA:$AA,'Pressupost - Pressupuesto'!$A8,'Detall - Detalle'!$Z:$Z,I$4))","v":0},{"$f":"+IF(OR($A$1=\"TOTES LES ACTIVITATS\",$A$1=\"\"),SUMIFS('Detall - Detalle'!$V:$V,'Detall - Detalle'!$AA:$AA,'Pressupost - Pressupuesto'!$A8,'Detall - Detalle'!$Z:$Z,J$4),SUMIFS('Detall - Detalle'!$V:$V,'Detall - Detalle'!$T:$T,'Pressupost - Pressupuesto'!$A$1,'Detall - Detalle'!$AA:$AA,'Pressupost - Pressupuesto'!$A8,'Detall - Detalle'!$Z:$Z,J$4))","v":0},{"$f":"+IF(OR($A$1=\"TOTES LES ACTIVITATS\",$A$1=\"\"),SUMIFS('Detall - Detalle'!$V:$V,'Detall - Detalle'!$AA:$AA,'Pressupost - Pressupuesto'!$A8,'Detall - Detalle'!$Z:$Z,K$4),SUMIFS('Detall - Detalle'!$V:$V,'Detall - Detalle'!$T:$T,'Pressupost - Pressupuesto'!$A$1,'Detall - Detalle'!$AA:$AA,'Pressupost - Pressupuesto'!$A8,'Detall - Detalle'!$Z:$Z,K$4))","v":0},{"$f":"+IF(OR($A$1=\"TOTES LES ACTIVITATS\",$A$1=\"\"),SUMIFS('Detall - Detalle'!$V:$V,'Detall - Detalle'!$AA:$AA,'Pressupost - Pressupuesto'!$A8,'Detall - Detalle'!$Z:$Z,L$4),SUMIFS('Detall - Detalle'!$V:$V,'Detall - Detalle'!$T:$T,'Pressupost - Pressupuesto'!$A$1,'Detall - Detalle'!$AA:$AA,'Pressupost - Pressupuesto'!$A8,'Detall - Detalle'!$Z:$Z,L$4))","v":0},{"$f":"+IF(OR($A$1=\"TOTES LES ACTIVITATS\",$A$1=\"\"),SUMIFS('Detall - Detalle'!$V:$V,'Detall - Detalle'!$AA:$AA,'Pressupost - Pressupuesto'!$A8,'Detall - Detalle'!$Z:$Z,M$4),SUMIFS('Detall - Detalle'!$V:$V,'Detall - Detalle'!$T:$T,'Pressupost - Pressupuesto'!$A$1,'Detall - Detalle'!$AA:$AA,'Pressupost - Pressupuesto'!$A8,'Detall - Detalle'!$Z:$Z,M$4))","v":0},{"$f":"+IF(OR($A$1=\"TOTES LES ACTIVITATS\",$A$1=\"\"),SUMIFS('Detall - Detalle'!$V:$V,'Detall - Detalle'!$AA:$AA,'Pressupost - Pressupuesto'!$A8,'Detall - Detalle'!$Z:$Z,N$4),SUMIFS('Detall - Detalle'!$V:$V,'Detall - Detalle'!$T:$T,'Pressupost - Pressupuesto'!$A$1,'Detall - Detalle'!$AA:$AA,'Pressupost - Pressupuesto'!$A8,'Detall - Detalle'!$Z:$Z,N$4))","v":0},{"$f":"+SUMIFS('Detall - Detalle'!$V:$V,'Detall - Detalle'!$T:$T,O$4,'Detall - Detalle'!$AA:$AA,'Pressupost - Pressupuesto'!$A8)","v":0},{"$f":"+SUMIFS('Detall - Detalle'!$V:$V,'Detall - Detalle'!$T:$T,P$4,'Detall - Detalle'!$AA:$AA,'Pressupost - Pressupuesto'!$A8)","v":0},{"$f":"+SUMIFS('Detall - Detalle'!$V:$V,'Detall - Detalle'!$T:$T,Q$4,'Detall - Detalle'!$AA:$AA,'Pressupost - Pressupuesto'!$A8)","v":0},{"$f":"+SUMIFS('Detall - Detalle'!$V:$V,'Detall - Detalle'!$T:$T,R$4,'Detall - Detalle'!$AA:$AA,'Pressupost - Pressupuesto'!$A8)","v":0},{"$f":"+SUMIFS('Detall - Detalle'!$V:$V,'Detall - Detalle'!$T:$T,S$4,'Detall - Detalle'!$AA:$AA,'Pressupost - Pressupuesto'!$A8)","v":0},{"$f":"+SUMIFS('Detall - Detalle'!$V:$V,'Detall - Detalle'!$T:$T,T$4,'Detall - Detalle'!$AA:$AA,'Pressupost - Pressupuesto'!$A8)","v":0},{"$f":"+SUMIFS('Detall - Detalle'!$V:$V,'Detall - Detalle'!$T:$T,U$4,'Detall - Detalle'!$AA:$AA,'Pressupost - Pressupuesto'!$A8)","v":0},{"$f":"+SUMIFS('Detall - Detalle'!$V:$V,'Detall - Detalle'!$T:$T,V$4,'Detall - Detalle'!$AA:$AA,'Pressupost - Pressupuesto'!$A8)","v":0},{"$f":"+SUMIFS('Detall - Detalle'!$V:$V,'Detall - Detalle'!$T:$T,W$4,'Detall - Detalle'!$AA:$AA,'Pressupost - Pressupuesto'!$A8)","v":0},{"$f":"+SUMIFS('Detall - Detalle'!$V:$V,'Detall - Detalle'!$T:$T,X$4,'Detall - Detalle'!$AA:$AA,'Pressupost - Pressupuesto'!$A8)","v":0},{"$f":"+SUMIFS('Detall - Detalle'!$V:$V,'Detall - Detalle'!$T:$T,Y$4,'Detall - Detalle'!$AA:$AA,'Pressupost - Pressupuesto'!$A8)","v":0},{"$f":"+SUMIFS('Detall - Detalle'!$V:$V,'Detall - Detalle'!$T:$T,Z$4,'Detall - Detalle'!$AA:$AA,'Pressupost - Pressupuesto'!$A8)","v":0},{"$f":"+SUMIFS('Detall - Detalle'!$V:$V,'Detall - Detalle'!$T:$T,AA$4,'Detall - Detalle'!$AA:$AA,'Pressupost - Pressupuesto'!$A8)","v":0},{"$f":"+SUMIFS('Detall - Detalle'!$V:$V,'Detall - Detalle'!$T:$T,AB$4,'Detall - Detalle'!$AA:$AA,'Pressupost - Pressupuesto'!$A8)","v":0},{"$f":"+SUMIFS('Detall - Detalle'!$V:$V,'Detall - Detalle'!$T:$T,AC$4,'Detall - Detalle'!$AA:$AA,'Pressupost - Pressupuesto'!$A8)","v":0},{"$f":"+SUMIFS('Detall - Detalle'!$V:$V,'Detall - Detalle'!$T:$T,AD$4,'Detall - Detalle'!$AA:$AA,'Pressupost - Pressupuesto'!$A8)","v":0},{"$f":"+SUMIFS('Detall - Detalle'!$V:$V,'Detall - Detalle'!$T:$T,AE$4,'Detall - Detalle'!$AA:$AA,'Pressupost - Pressupuesto'!$A8)","v":0},{"$f":"+SUMIFS('Detall - Detalle'!$V:$V,'Detall - Detalle'!$T:$T,AF$4,'Detall - Detalle'!$AA:$AA,'Pressupost - Pressupuesto'!$A8)","v":0},{"$f":"+SUMIFS('Detall - Detalle'!$V:$V,'Detall - Detalle'!$T:$T,AG$4,'Detall - Detalle'!$AA:$AA,'Pressupost - Pressupuesto'!$A8)","v":0},{"$f":"+SUMIFS('Detall - Detalle'!$V:$V,'Detall - Detalle'!$T:$T,AH$4,'Detall - Detalle'!$AA:$AA,'Pressupost - Pressupuesto'!$A8)","v":0}]
{"$rows_left_out":25}
{"sheet":"Detall - Detalle","index":3,"n_rows":81,"n_cols":31,"rows_kept":81,"cut":false,"hidden":false,"merged":[[1,0,2,2],[4,28,4,30],[4,10,4,15],[4,0,4,9],[4,16,4,24],[4,25,4,27]]}
[]
["Introducció del detall de les despeses del projecte / \nIntoducción del detalle de los gastos del proyecto"]
[]
[]
["DADES DE LES DESPESES / DATOS DE LOS GASTOS",null,null,null,null,null,null,null,null,null,"QUI FINANÇA LES DESPESES? / QUIEN FINANCIA LOS GASTOS?",null,null,null,null,null,"A QUINES ACTIVITATS AFECTA? / A QUE ACTIVIDADES AFECTAN LOS GASTOS?",null,null,null,null,null,null,null,null,"FILTRES / FILTROS",null,null,"AUXILIARS CÀLCULS"]
["ENTITAT QUE EXECUTA LA DESPESA / ENTIDAD EJECUTORA DEL GASTO","AGRUPADA-SOCIA LOCAL / AGRUPADA-SOCIA LOCAL","CONCEPTE PRESSUPOST / CONCEPTO PRESUPUESTO","DETALL DESPESA / DETALLE GASTO","VALORITZACIÓ / VALORIZACIÓN","SUBCONTRACTACIÓ / SUBCONTRATACIÓN","UNITATS / UNIDADES","QUANTITAT / CANTIDAD","PREU UNITARI / PRECIO UNITARIO","IMPORT / IMPORTE","% ACCD / \n%  ACCD","TOTAL ACCD / TOTAL ACCD","% ALTRES FINANÇADORS / \n% OTROS FINANCIADORES","TOTAL ALTRES FINANÇADORS / TOTAL OTROS FINANCIADORES","% ENTITAT EXECUTORA / \n% ENTIDAD EJECUTORA","TOTAL ENTITAT EXECUTORA / TOTAL ENTIDAD EJECUTORA","NÚM. D'ACTIVITATS AFECTADES / NÚM. ACTIVIDADES AFECTADAS","CHECK","COMPTADOR / CONTADOR","ACTIVITAT / ACTIVIDAD","% IMPUTAT A LA ACTIVITAT / % IMPUTADO A LA ACTIVIDAD","IMPORT ACTIVITAT / IMPORTE ACTIVIDAD","IMPORT ACCD / IMPORTE ACCD","IMPORT ALTRES FINANÇADORS / IMPORTE OTROS FINANCIADORES","IMPORT ENTITAT / IMPORTE ENTIDAD","ENTITAT EXECUTORA / ENTIDAD EJECUTORA","CONCEPTE PRESSUPOST / CONCEPTO PRESSUPUESTO","DETALL DESPESA / DETALLE GASTO","IMPORT","% FINANÇAT ACCD","% IMPUTAT ALTRES FINANÇADORS"]
[null,null,null,null,null,null,null,null,null,{"$f":"+IF(I7<>\"\",I7*H7,\"\")","v":""},null,{"$f":"+IF(I7<>\"\",K7*J7,\"\")","v":""},null,{"$f":"+IF(I7<>\"\",M7*J7,\"\")","v":""},{"$f":"IF(I7<>\"\",1-K7-M7,\"\")","v":""},{"$f":"+IFERROR(J7-L7-N7,\"\")","v":""},null,{"$f":"IF(Q7<>\"\",IF(SUM(OFFSET(W7,0,0,Q7,3))=J7,1,0),\"\")","v":""},{"$f":"+IFERROR(IF(Q7<>\"\",Q7,IF(S6>1,S6-1,\"\")),\"\")","v":""},null,null,{"$f":"+IFERROR(IF(Q7=1,AC7,IF(U7<>\"\",U7*AC7,\"\")),\"\")","v":""},{"$f":"+IFERROR(IF(V7<>\"\",AD7*V7,\"\"),\"\")","v":""},{"$f":"+IFERROR(IF(V7<>\"\",V7*AE7,\"\"),\"\")","v":""},{"$f":"+IFERROR(V7-W7-X7,\"\")","v":""},{"$f":"+IF(S7<>\"\",IF(A7<>\"\",A7,Z6),\"\")","v":""},{"$f":"+IF(S7<>\"\",IF(C7<>\"\",C7,AA6),\"\")","v":""},{"$f":"+IF(S7<>\"\",IF(D7<>\"\",D7,AB6),\"\")","v":""},{"$f":"+IF(S7<>\"\",IF(J7<>\"\",J7,AC6),\"\")","v":""},{"$f":"+IF(S7<>\"\",IF(J7<>\"\",K7,AD6),\"\")","v":""},{"$f":"+IF(S7<>\"\",IF(J7<>\"\",M7,AE6),\"\")","v":""}]
[null,null,null,null,null,null,null,null,null,{"$f":"+IF(I8<>\"\",I8*H8,\"\")","v":""},null,{"$f":"+IF(I8<>\"\",K8*J8,\"\")","v":""},null,{"$f":"+IF(I8<>\"\",M8*J8,\"\")","v":""},{"$f":"IF(I8<>\"\",1-K8-M8,\"\")","v":""},{"$f":"+IFERROR(J8-L8-N8,\"\")","v":""},null,{"$f":"IF(Q8<>\"\",IF(SUM(OFFSET(W8,0,0,Q8,3))=J8,1,0),\"\")","v":""},"",null,null,"",{"$f":"+IFERROR(IF(V8<>\"\",AD8*V8,\"\"),\"\")","v":""},{"$f":"+IFERROR(IF(V8<>\"\",V8*AE8,\"\"),\"\")","v":""},{"$f":"+IFERROR(V8-W8-X8,\"\")","v":""},{"$f":"+IF(S8<>\"\",IF(A8<>\"\",A8,Z7),\"\")","v":""},{"$f":"+IF(S8<>\"\",IF(C8<>\"\",C8,AA7),\"\")","v":""},{"$f":"+IF(S8<>\"\",IF(D8<>\"\",D8,AB7),\"\")","v":""},{"$f":"+IF(S8<>\"\",IF(J8<>\"\",J8,AC7),\"\")","v":""},{"$f":"+IF(S8<>\"\",IF(J8<>\"\",K8,AD7),\"\")","v":""},{"$f":"+IF(S8<>\"\",IF(J8<>\"\",M8,AE7),\"\")","v":""}]
{"$rows_left_out":74}
{"sheet":"Llista desplegable","index":4,"n_rows":49,"n_cols":13,"rows_kept":49,"cut":false,"hidden":true,"merged":[]}
["Partida pressupostària",null,"Executor del projecte/finançador",null,"Valorització",null,"Unitats",null,"Tipus_projecte",null,null,"Màxim","Mínim"]
["a1.1 Personal assalariat local / Personal asalariado local",null,"Líder",null,"Sí",null,"Hores",null,"Desenvolupament",null,"DesenvolupamentIndividual",300000,150000]
["a1.2 Personal assalariat expatriat / Personal asalariado expatriado",null,"Agrupada",null,null,null,"Dies",null,"Educació global",null,"DesenvolupamentAgrupació",450000,150000]
["a1.3 Personal assalariat a Catalunya / Personal asalariado Cataluña",null,"Soci_local",null,null,null,"Mesos",null,null,null,"Educació globalIndividual",200000,100000]
["a2 Lloguers / Alquileres",null,"Col·lectius protagonistes",null,null,null,"Anys",null,null,null,"Educació globalAgrupació",350000,100000]
["a3 Manteniment, conservació i reparació / Mantenimiento, conservación y reparación",null,"Tercer sector",null,null,null,"Unitats"]
["a4 Material ordinari / Material ordinario",null,null,null,null,null,"Servei"]
["a5 Subministraments / Suministros",null,null,null,null,null,"Litres"]
{"$rows_left_out":41}